{"text_format":"1","workbook":"xlsx","n_sheets":11,"sheets":["HPイメージ","項目リスト","入力説明","品目シート①","品目シート②","品目シート③","品目シート④","品目シート⑤","減価償却費（入力シート）","結果・労働時間","経営指標DATA"],"not_rendered":{"charts":7,"images":3,"macros":1,"external_links":1,"defined_names":104,"comments":2,"pivot_tables":0},"unopened":[],"bounds":{"document_bytes":16777216,"sheet_cells":100000,"rows_first":2000,"rows_last":500,"rows_between":2000,"halvings":0,"cell_chars":16384,"cell_head_chars":4096},"cells_cut":0,"cells_raw":0,"read":"whole","date_system":"1900"}

{"sheet":"HPイメージ","index":0,"n_rows":42,"n_cols":17,"rows_kept":42,"cut":false,"hidden":false,"merged":[[1,1,1,9],[6,10,6,11],[6,12,6,13]]}
[]
[null,"あなたの経営をシミュレーションしてみませんか？？"]
[]
[null,"①作目及び面積、従業員数を入力してください"]
[]
[]
{"$rows_left_out":37}
{"sheet":"項目リスト","index":1,"n_rows":27,"n_cols":13,"rows_kept":27,"cut":false,"hidden":false,"merged":[[0,1,0,12],[26,9,26,12]]}
[null,"経営指標2020　メニューリスト\n※内容や数値については熊本県経営指標を参照しています"]
[null,1,"水稲40ha","26","夏秋ｷｭｳﾘ","51","ﾆｶﾞｳﾘ","76","極早生温州","101","すももﾊｳｽ","126","鶏:採卵3万羽規模千羽当"]
[null,2,"水稲20ha","27","夏秋ﾋﾟｰﾏﾝ","52","深ﾈｷﾞ","77","早生温州","102","かき太秋","127","鶏:ﾌﾞﾛｲﾗｰ5万羽規模千羽当"]
[null,3,"水稲10ha","28","冬春ﾋﾟｰﾏﾝ","53","ﾆﾗ","78","普通温州","103","ぶどうﾄﾝﾈﾙ","128","水稲（ドローン）"]
[null,4,"水稲5ha","29","春夏ｽｲｶ","54","ｽﾅｯﾌﾟｴﾝﾄﾞｳ","79","ﾊｳｽみかん","104","ぶどう無加温","129","酪農80頭（搾乳ロボット等）"]
[null,5,"小麦","30","小玉ｽｲｶ","55","ﾌﾞﾛｯｺﾘｰ","80","ﾊｳｽみかん(ｸﾞﾘｰﾝ)","105","くり","130","酪農200頭（搾乳ロボット等）"]
{"$rows_left_out":22}
{"sheet":"入力説明","index":2,"n_rows":104,"n_cols":33,"rows_kept":104,"cut":false,"hidden":false,"merged":[[5,1,7,3],[5,15,7,17],[6,10,7,10],[1,1,1,7],[2,1,3,6],[3,9,3,21],[4,1,4,6],[4,15,4,20],[8,1,9,3],[8,15,9,17],[10,1,10,3],[10,15,10,17],[11,1,11,6],[11,15,11,20],[12,1,12,6],[12,9,12,10],[12,15,12,20],[13,1,13,6],[13,15,13,20],[39,17,39,20],[46,1,49,3],[46,15,49,17],[53,1,53,6],[53,15,53,20],[42,2,42,6],[42,16,42,20],[15,1,45,1],[15,2,41,2],[15,3,38,3],[15,15,45,15],[15,16,41,16],[15,17,38,17],[38,4,38,6],[38,18,38,20],[39,3,39,6],[50,9,50,10],[51,9,51,10],[51,15,51,20],[57,1,57,6],[57,15,57,20],[54,1,54,6],[54,15,54,20],[55,1,55,6],[55,15,55,20],[56,1,56,6],[56,15,56,20]]}
[]
[null,"基本シート※NO.面積入力後10aで自動計算"]
[null,"　　　　　　　　　   　　　作物名・作型等\n　項目",null,null,null,null,null,1,null,null,null,null,null,null,null,null,null,null,null,null,null,null,null,null,null,"損益分岐点粗収入＝固定費÷（１－変動費比率）"]
[null,null,null,null,null,null,null,{"$f":"IF(H$3=\"\",\"\",HLOOKUP(H$3,経営指標DATA!$H$2:$EP$109,経営指標DATA!$A3))","v":"水稲\n40ha"},null,"計算シート",null,null,null,null,null,null,null,null,null,null,null,null,null,null,null,"　　　　　　　　　　　　＝固定費÷（１－変動費÷農業粗収入）"]
[null,"経営面積（a）",null,null,null,null,null,10,null,null,null,null,null,null,null,"経営面積（a）",null,null,null,null,null,10,null,null,null,"10a当たり"]
[null,"生産販売",null,null,"生産量",null,"kg・本・頭",{"$f":"IF(H$3=\"\",\"\",HLOOKUP(H$3,経営指標DATA!$H$2:$EP$109,経営指標DATA!$A5))*$H$5/10","v":520},null,null,"青色セル",null,null,null,null,"生産販売",null,null,"生産量",null,"kg・本・頭",{"$f":"IF(H$3=\"\",\"\",HLOOKUP(H$3,経営指標DATA!$H$2:$EP$109,経営指標DATA!$A5))*$V$5/10","v":520},null,null,null,null,"売上(粗収益)",{"$f":"$V$12","v":118860},null,null,"変動比率"]
{"$rows_left_out":99}
{"sheet":"品目シート①","index":3,"n_rows":104,"n_cols":33,"rows_kept":104,"cut":false,"hidden":false,"merged":[[55,1,55,6],[56,1,56,6],[57,1,57,6],[12,1,12,6],[13,1,13,6],[15,1,45,1],[15,2,41,2],[15,3,38,3],[38,4,38,6],[39,3,39,6],[42,2,42,6],[1,1,1,7],[46,1,49,3],[53,1,53,6],[54,1,54,6],[2,1,3,6],[4,1,4,6],[5,1,7,3],[8,1,9,3],[10,1,10,3],[11,1,11,6],[56,15,56,20],[57,15,57,20],[12,15,12,20],[13,15,13,20],[15,15,45,15],[15,16,41,16],[42,16,42,20],[46,15,49,17],[15,17,38,17],[38,18,38,20],[39,17,39,20],[12,9,12,10],[3,9,3,21],[53,15,53,20],[54,15,54,20],[55,15,55,20],[4,15,4,20],[5,15,7,17],[8,15,9,17],[10,15,10,17],[11,15,11,20],[6,10,7,10],[50,9,50,10],[51,9,51,10],[51,15,51,20]]}
[]
[null,"基本シート※NO.面積入力後10aで自動計算"]
[null,"　　　　　　　　　   　　　作物名・作型等\n　項目",null,null,null,null,null,{"$f":"HPイメージ!D8","v":5},null,null,null,null,null,null,null,null,null,null,null,null,null,null,null,null,null,"損益分岐点粗収入＝固定費÷（１－変動費比率）"]
[null,null,null,null,null,null,null,{"$f":"IF(H$3=\"\",\"\",HLOOKUP(H$3,経営指標DATA!$H$2:$EP$109,経営指標DATA!$A3))","v":"小麦"},null,"計算シート",null,null,null,null,null,null,null,null,null,null,null,null,null,null,null,"　　　　　　　　　　　　＝固定費÷（１－変動費÷農業粗収入）"]
[null,"経営面積（a）",null,null,null,null,null,10,null,null,null,null,null,null,null,"経営面積（a）",null,null,null,null,null,{"$f":"HPイメージ!G8","v":40},null,null,null,"10a当たり"]
[null,"生産販売",null,null,"生産量",null,"kg・本・頭",{"$f":"IF(H$3=\"\",\"\",HLOOKUP(H$3,経営指標DATA!$H$2:$EP$109,経営指標DATA!$A5))*$H$5/10","v":450},null,null,"青色セル",null,null,null,null,"生産販売",null,null,"生産量",null,"kg・本・頭",{"$f":"IF(H$3=\"\",\"\",HLOOKUP(H$3,経営指標DATA!$H$2:$EP$109,経営指標DATA!$A5))*$V$5/10","v":1800},null,null,null,null,"売上(粗収益)",{"$f":"$V$12","v":298800},null,null,"変動比率"]
{"$rows_left_out":99}
{"sheet":"品目シート②","index":4,"n_rows":104,"n_cols":33,"rows_kept":104,"cut":false,"hidden":false,"merged":[[50,9,50,10],[51,9,51,10],[51,15,51,20],[57,1,57,6],[57,15,57,20],[54,1,54,6],[54,15,54,20],[55,1,55,6],[55,15,55,20],[56,1,56,6],[56,15,56,20],[39,17,39,20],[46,1,49,3],[46,15,49,17],[53,1,53,6],[53,15,53,20],[42,2,42,6],[42,16,42,20],[15,1,45,1],[15,2,41,2],[15,3,38,3],[15,15,45,15],[15,16,41,16],[15,17,38,17],[38,4,38,6],[38,18,38,20],[39,3,39,6],[1,1,1,7],[2,1,3,6],[3,9,3,21],[4,1,4,6],[4,15,4,20],[5,1,7,3],[5,15,7,17],[6,10,7,10],[8,1,9,3],[8,15,9,17],[13,1,13,6],[10,1,10,3],[10,15,10,17],[11,1,11,6],[11,15,11,20],[12,1,12,6],[12,9,12,10],[12,15,12,20],[13,15,13,20]]}
[]
[null,"基本シート※NO.面積入力後10aで自動計算"]
[null,"　　　　　　　　　   　　　作物名・作型等\n　項目",null,null,null,null,null,{"$f":"HPイメージ!D10","v":5},null,null,null,null,null,null,null,null,null,null,null,null,null,null,null,null,null,"損益分岐点粗収入＝固定費÷（１－変動費比率）"]
[null,null,null,null,null,null,null,{"$f":"IF(H$3=\"\",\"\",HLOOKUP(H$3,経営指標DATA!$H$2:$EP$109,経営指標DATA!$A3))","v":"小麦"},null,"計算シート",null,null,null,null,null,null,null,null,null,null,null,null,null,null,null,"　　　　　　　　　　　　＝固定費÷（１－変動費÷農業粗収入）"]
[null,"経営面積（a）",null,null,null,null,null,10,null,null,null,null,null,null,null,"経営面積（a）",null,null,null,null,null,{"$f":"HPイメージ!G10","v":40},null,null,null,"10a当たり"]
[null,"生産販売",null,null,"生産量",null,"kg・本・頭",{"$f":"IF(H$3=\"\",\"\",HLOOKUP(H$3,経営指標DATA!$H$2:$EP$109,経営指標DATA!$A5))*$H$5/10","v":450},null,null,"青色セル",null,null,null,null,"生産販売",null,null,"生産量",null,"kg・本・頭",{"$f":"IF(H$3=\"\",\"\",HLOOKUP(H$3,経営指標DATA!$H$2:$EP$109,経営指標DATA!$A5))*$V$5/10","v":1800},null,null,null,null,"売上(粗収益)",{"$f":"$V$12","v":298800},null,null,"変動比率"]
{"$rows_left_out":99}
{"sheet":"品目シート③","index":5,"n_rows":104,"n_cols":33,"rows_kept":104,"cut":false,"hidden":false,"merged":[[50,9,50,10],[51,9,51,10],[51,15,51,20],[57,1,57,6],[57,15,57,20],[54,1,54,6],[54,15,54,20],[55,1,55,6],[55,15,55,20],[56,1,56,6],[56,15,56,20],[39,17,39,20],[46,1,49,3],[46,15,49,17],[53,1,53,6],[53,15,53,20],[42,2,42,6],[42,16,42,20],[15,1,45,1],[15,2,41,2],[15,3,38,3],[15,15,45,15],[15,16,41,16],[15,17,38,17],[38,4,38,6],[38,18,38,20],[39,3,39,6],[1,1,1,7],[2,1,3,6],[3,9,3,21],[4,1,4,6],[4,15,4,20],[5,1,7,3],[5,15,7,17],[6,10,7,10],[8,1,9,3],[8,15,9,17],[13,1,13,6],[10,1,10,3],[10,15,10,17],[11,1,11,6],[11,15,11,20],[12,1,12,6],[12,9,12,10],[12,15,12,20],[13,15,13,20]]}
[]
[null,"基本シート※NO.面積入力後10aで自動計算"]
[null,"　　　　　　　　　   　　　作物名・作型等\n　項目",null,null,null,null,null,{"$f":"HPイメージ!D12","v":5},null,null,null,null,null,null,null,null,null,null,null,null,null,null,null,null,null,"損益分岐点粗収入＝固定費÷（１－変動費比率）"]
[null,null,null,null,null,null,null,{"$f":"IF(H$3=\"\",\"\",HLOOKUP(H$3,経営指標DATA!$H$2:$EP$109,経営指標DATA!$A3))","v":"小麦"},null,"計算シート",null,null,null,null,null,null,null,null,null,null,null,null,null,null,null,"　　　　　　　　　　　　＝固定費÷（１－変動費÷農業粗収入）"]
[null,"経営面積（a）",null,null,null,null,null,10,null,null,null,null,null,null,null,"経営面積（a）",null,null,null,null,null,{"$f":"HPイメージ!G12","v":40},null,null,null,"10a当たり"]
[null,"生産販売",null,null,"生産量",null,"kg・本・頭",{"$f":"IF(H$3=\"\",\"\",HLOOKUP(H$3,経営指標DATA!$H$2:$EP$109,経営指標DATA!$A5))*$H$5/10","v":450},null,null,"青色セル",null,null,null,null,"生産販売",null,null,"生産量",null,"kg・本・頭",{"$f":"IF(H$3=\"\",\"\",HLOOKUP(H$3,経営指標DATA!$H$2:$EP$109,経営指標DATA!$A5))*$V$5/10","v":1800},null,null,null,null,"売上(粗収益)",{"$f":"$V$12","v":298800},null,null,"変動比率"]
{"$rows_left_out":99}
{"sheet":"品目シート④","index":6,"n_rows":104,"n_cols":33,"rows_kept":104,"cut":false,"hidden":false,"merged":[[50,15,50,20],[51,15,51,20],[50,9,50,10],[51,9,51,10],[57,1,57,6],[57,15,57,20],[54,1,54,6],[54,15,54,20],[55,1,55,6],[55,15,55,20],[56,1,56,6],[56,15,56,20],[39,17,39,20],[46,1,49,3],[46,15,49,17],[53,1,53,6],[53,15,53,20],[42,2,42,6],[42,16,42,20],[15,1,45,1],[15,2,41,2],[15,3,38,3],[15,15,45,15],[15,16,41,16],[15,17,38,17],[38,4,38,6],[38,18,38,20],[39,3,39,6],[12,1,12,6],[12,9,12,10],[12,15,12,20],[13,1,13,6],[13,15,13,20],[8,1,9,3],[8,15,9,17],[10,1,10,3],[10,15,10,17],[11,1,11,6],[11,15,11,20],[5,1,7,3],[5,15,7,17],[6,10,7,10],[1,1,1,7],[2,1,3,6],[3,9,3,21],[4,1,4,6],[4,15,4,20]]}
[]
[null,"基本シート※NO.面積入力後10aで自動計算"]
[null,"　　　　　　　　　   　　　作物名・作型等\n　項目",null,null,null,null,null,{"$f":"HPイメージ!D14","v":5},null,null,null,null,null,null,null,null,null,null,null,null,null,null,null,null,null,"損益分岐点粗収入＝固定費÷（１－変動費比率）"]
[null,null,null,null,null,null,null,{"$f":"IF(H$3=\"\",\"\",HLOOKUP(H$3,経営指標DATA!$H$2:$EP$109,経営指標DATA!$A3))","v":"小麦"},null,"計算シート",null,null,null,null,null,null,null,null,null,null,null,null,null,null,null,"　　　　　　　　　　　　＝固定費÷（１－変動費÷農業粗収入）"]
[null,"経営面積（a）",null,null,null,null,null,10,null,null,null,null,null,null,null,"経営面積（a）",null,null,null,null,null,{"$f":"HPイメージ!G14","v":40},null,null,null,"10a当たり"]
[null,"生産販売",null,null,"生産量",null,"kg・本・頭",{"$f":"IF(H$3=\"\",\"\",HLOOKUP(H$3,経営指標DATA!$H$2:$EP$109,経営指標DATA!$A5))*$H$5/10","v":450},null,null,"青色セル",null,null,null,null,"生産販売",null,null,"生産量",null,"kg・本・頭",{"$f":"IF(H$3=\"\",\"\",HLOOKUP(H$3,経営指標DATA!$H$2:$EP$109,経営指標DATA!$A5))*$V$5/10","v":1800},null,null,null,null,"売上(粗収益)",{"$f":"$V$12","v":298800},null,null,"変動比率"]
{"$rows_left_out":99}
{"sheet":"品目シート⑤","index":7,"n_rows":104,"n_cols":33,"rows_kept":104,"cut":false,"hidden":false,"merged":[[50,9,50,10],[51,9,51,10],[51,15,51,20],[57,1,57,6],[57,15,57,20],[54,1,54,6],[54,15,54,20],[55,1,55,6],[55,15,55,20],[56,1,56,6],[56,15,56,20],[39,17,39,20],[46,1,49,3],[46,15,49,17],[53,1,53,6],[53,15,53,20],[42,2,42,6],[42,16,42,20],[15,1,45,1],[15,2,41,2],[15,3,38,3],[15,15,45,15],[15,16,41,16],[15,17,38,17],[38,4,38,6],[38,18,38,20],[39,3,39,6],[12,1,12,6],[12,9,12,10],[12,15,12,20],[13,1,13,6],[13,15,13,20],[8,1,9,3],[8,15,9,17],[10,1,10,3],[10,15,10,17],[11,1,11,6],[11,15,11,20],[5,1,7,3],[5,15,7,17],[6,10,7,10],[1,1,1,7],[2,1,3,6],[3,9,3,21],[4,1,4,6],[4,15,4,20]]}
[]
[null,"基本シート※NO.面積入力後10aで自動計算"]
[null,"　　　　　　　　　   　　　作物名・作型等\n　項目",null,null,null,null,null,{"$f":"HPイメージ!D16","v":5},null,null,null,null,null,null,null,null,null,null,null,null,null,null,null,null,null,"損益分岐点粗収入＝固定費÷（１－変動費比率）"]
[null,null,null,null,null,null,null,{"$f":"IF(H$3=\"\",\"\",HLOOKUP(H$3,経営指標DATA!$H$2:$EP$109,経営指標DATA!$A3))","v":"小麦"},null,"計算シート",null,null,null,null,null,null,null,null,null,null,null,null,null,null,null,"　　　　　　　　　　　　＝固定費÷（１－変動費÷農業粗収入）"]
[null,"経営面積（a）",null,null,null,null,null,10,null,null,null,null,null,null,null,"経営面積（a）",null,null,null,null,null,{"$f":"HPイメージ!G16","v":40},null,null,null,"10a当たり"]
[null,"生産販売",null,null,"生産量",null,"kg・本・頭",{"$f":"IF(H$3=\"\",\"\",HLOOKUP(H$3,経営指標DATA!$H$2:$EP$109,経営指標DATA!$A5))*$H$5/10","v":450},null,null,"青色セル",null,null,null,null,"生産販売",null,null,"生産量",null,"kg・本・頭",{"$f":"IF(H$3=\"\",\"\",HLOOKUP(H$3,経営指標DATA!$H$2:$EP$109,経営指標DATA!$A5))*$V$5/10","v":1800},null,null,null,null,"売上(粗収益)",{"$f":"$V$12","v":298800},null,null,"変動比率"]
{"$rows_left_out":99}
{"sheet":"減価償却費（入力シート）","index":8,"n_rows":24,"n_cols":17,"rows_kept":24,"cut":false,"hidden":false,"merged":[[23,12,23,16],[2,12,2,16],[2,2,3,2],[4,1,9,1],[10,1,19,1],[20,1,20,2],[2,7,2,11]]}
[]
[null,"減価償却費試算表"]
[null,null,"種類・規模","購入時価格","法定耐用","算定耐用","減価償却費","割合（計100％）",null,null,null,null,"金額"]
[null,null,null,"（Ａ）","年数 （B）","年数 （Ｃ）","（A）/（C）","品目①","品目②","品目③","品目④","品目⑤","品目①","品目②","品目③","品目④","品目⑤"]
[null,"建\n物\n・\n施\n設","農舎",5900000,24,30,{"$f":"D5/F5","v":196666.66666666666},0.2,0.2,0.2,0.4,0,{"$f":"$G5*H5","v":39333.333333333336},{"$f":"$G5*I5","v":39333.333333333336},{"$f":"$G5*J5","v":39333.333333333336},78666.666666666672,0]
[null,null,null,null,null,null,null,0,0,0,0,0,{"$f":"$G6*H6","v":0},0,0,0,0]
{"$rows_left_out":19}
{"sheet":"結果・労働時間","index":9,"n_rows":32,"n_cols":24,"rows_kept":32,"cut":false,"hidden":false,"merged":[[1,23,5,23],[5,10,5,11],[4,10,4,11],[3,10,3,11],[9,10,9,11],[8,10,8,11],[7,10,7,11],[6,10,6,11],[1,22,3,22],[1,21,4,21],[1,20,4,20],[30,13,30,14],[13,1,13,11],[1,1,2,11],[2,19,3,19],[2,18,3,18],[2,17,3,17],[2,16,3,16],[2,15,3,15],[2,14,3,14],[30,3,30,4]]}
[]
[null,"結果集計",null,null,null,null,null,null,null,null,null,null,null,null,null,"作目1","作目2","作目3","作目4","作目5","合計\n※経営指標\nから算出","労働限界\n※労働時間\nの設定転記","労働時間の余剰","月ごと"]
[null,null,null,null,null,null,null,null,null,null,null,null,null,null,"作目名",{"$f":"品目シート①!$H4","v":"小麦"},{"$f":"品目シート②!$H4","v":"小麦"},{"$f":"品目シート③!$H4","v":"小麦"},{"$f":"品目シート④!$H4","v":"小麦"},{"$f":"品目シート⑤!$H4","v":"小麦"}]
[null,"種類","コード番号","作目名","規模面積頭羽数","粗収入","経営費","農業所得","所得率","労働時間","時間／単位(10ａ等)"]
[null,1,{"$f":"品目シート①!$H$3","v":5},{"$f":"品目シート①!$H$4","v":"小麦"},{"$f":"品目シート①!$V$5","v":40},{"$f":"品目シート①!$V$12","v":298800},{"$f":"品目シート①!$V$54","v":219873.07833333334},{"$f":"品目シート①!$V$55","v":78926.921666666662},{"$f":"品目シート①!$V$56","v":26.414632418563137},{"$f":"$P$31","v":33.6},{"$f":"J5/(結果・労働時間!E5/10)","v":8.4},null,null,null,"面積(a)",{"$f":"品目シート①!$H5","v":10},{"$f":"品目シート②!$H5","v":10},{"$f":"品目シート③!$H5","v":10},{"$f":"品目シート④!$H5","v":10},{"$f":"品目シート⑤!$H5","v":10},null,null,"＋余り"]
[null,2,{"$f":"品目シート②!$H$3","v":5},{"$f":"品目シート②!$H$4","v":"小麦"},{"$f":"品目シート②!$V$5","v":40},{"$f":"品目シート②!$V$12","v":298800},{"$f":"品目シート②!$V$54","v":219873.07833333334},{"$f":"品目シート②!$V$55","v":78926.921666666662},{"$f":"品目シート②!$V$56","v":26.414632418563137},{"$f":"$Q$31","v":33.6},{"$f":"J6/(結果・労働時間!E6/10)","v":8.4},null,null,null,"×指標値",{"$f":"P5/10","v":1},{"$f":"Q5/10","v":1},1,1,1,"合計","労働限界","－不足"]
{"$rows_left_out":27}
{"sheet":"経営指標DATA","index":10,"n_rows":104,"n_cols":150,"rows_kept":104,"cut":false,"hidden":false,"merged":[[63,3,69,3],[10,1,10,6],[9,1,9,3],[4,1,6,3],[7,1,8,3],[2,1,3,6],[11,1,11,6],[56,1,56,6],[12,1,12,6],[14,1,44,1],[14,2,40,2],[14,3,37,3],[37,4,37,6],[38,3,38,6],[41,2,41,6],[45,1,48,3],[52,1,52,6],[53,1,53,6],[54,1,54,6],[55,1,55,6]]}
["行番号↓"]
[1,"[生産販売］",null,null,null,null,"列番号→",1,2,3,4,5,6,7,8,9,10,11,12,13,14,15,16,17,18,19,20,21,22,23,24,25,26,27,28,29,30,31,32,33,34,35,36,37,38,39,40,41,42,43,44,45,46,47,48,49,50,51,52,53,54,55,56,57,58,59,60,61,62,63,64,65,66,67,68,69,70,71,72,73,74,75,76,77,78,79,80,81,82,83,84,85,86,87,88,89,90,91,92,93,94,95,96,97,98,99,100,101,102,103,104,105,106,107,108,109,110,111,112,113,114,115,116,117,118,119,120,121,122,123,124,125,126,127,128,129,130,131,132,133,134,146,147,148,149,150]
[2,"　　　　　　　　　作物名・作型等\n　　　項　　目",null,null,null,null,null,"水稲\n40ha","水稲\n20ha","水稲\n10ha","水稲\n5ha","小麦","大麦","大豆","ｶﾝｼｮ","ﾊﾞﾚｲｼｮ","ｻﾄｲﾓ","冬ﾆﾝｼﾞﾝ","春ﾆﾝｼﾞﾝ","夏秋ﾀﾞｲｺﾝ","春ﾀﾞｲｺﾝ","水田ｺﾞﾎﾞｳ","ﾀﾏﾈｷﾞ","ｽｨｰﾄｺｰﾝ","夏秋ﾄﾏﾄ","冬ﾄﾏﾄ","冬春ﾄﾏﾄ","ﾐﾆﾄﾏﾄ","夏秋ﾐﾆﾄﾏﾄ","冬春ﾅｽ","夏秋ﾅｽ","冬春ｷｭｳﾘ","夏秋ｷｭｳﾘ","夏秋ﾋﾟｰﾏﾝ","冬春ﾋﾟｰﾏﾝ","春夏ｽｲｶ","小玉ｽｲｶ","春夏ﾒﾛﾝ\nｱﾝﾃﾞｽ","春夏ﾒﾛﾝ\nｸｲﾝｼｰ","春夏ﾒﾛﾝ\n肥後ｸﾞﾘｰﾝ","春夏ﾒﾛﾝ\nｱｰﾙｽ","秋冬ﾒﾛﾝ\n抑制","ｲﾁｺﾞ","ｲﾁｺﾞ高設","ｲﾝｹﾞﾝ\n半促成","ｲﾝｹﾞﾝ\n抑制","ｵｸﾗ\n露地","ｱｽﾊﾟﾗｶﾞｽ","ｷｬﾍﾞﾂ\n夏秋","ｷｬﾍﾞﾂ\n冬","冬ﾚﾀｽ","ﾎｳﾚﾝｿｳ\n夏秋","ﾊｸｻｲ\n秋冬","小ﾈｷﾞ","ｼｮｳｶﾞ","ﾚﾝｺﾝ\nﾊｳｽ","ﾚﾝｺﾝ","ﾆｶﾞｳﾘ","深ﾈｷﾞ","ﾆﾗ","ｽﾅｯﾌﾟｴﾝﾄﾞｳ","ﾌﾞﾛｯｺﾘｰ","電照ｷﾞｸ\n12月切り","小ｷﾞｸ\n夏秋切り ","ｽﾌﾟﾚｰｷﾞｸ\n12月切り","ｶｰﾈｰｼｮﾝ","ｽﾌﾟﾚｰ\nｶｰﾈｰｼｮﾝ","ﾊﾞﾗ","宿根ｶｽﾐｿｳ\n二度切り","宿根ｶｽﾐｿｳ\n加温促成","ｸｼﾞｬｸｱｽﾀｰ\n周年","ｽﾀｰﾁｽ\n加温促成","ｽﾀｰﾁｽ\n夏秋切り","ﾄﾙｺｷﾞｷｮｳ\n年内","ﾄﾙｺｷﾞｷｮｳ\n夏秋切り","ｽﾄｯｸ\n11~12月","ﾘﾝﾄﾞｳ\n夏秋","ｱﾘｳﾑ\n3~4月","ｶﾗｰ\n周年","ｵﾘｴﾝﾀﾙﾕﾘ\n12月","ｼｸﾗﾒﾝ\n12月","ﾊﾟﾝｼﾞｰ\n10~11月","極早生温州","早生温州","普通温州","ﾊｳｽみかん","ﾊｳｽみかん\n(ｸﾞﾘｰﾝ)","不知火\n露地","不知火\n屋根かけ","不知火\n加温","甘夏","晩白柚\n露地","晩白柚\nﾊｳｽ","ﾎﾟﾝｶﾝ","清見","河内晩柑","ﾊｳｽｷﾝｶﾝ","ゆず","なし\n幸水･露地","なし\n幸水ﾄﾝﾈﾙ","なし\n豊水","なし\n新高","なし\nあきづき","なし\n秋麗","もも\n露地","もも\nﾄﾝﾈﾙ","もも\n加温","すもも\nﾊｳｽ","かき\n太秋","ぶどう\nﾄﾝﾈﾙ","ぶどう\n無加温","くり","いちじく\n無加温","いちじく\n加温","ﾌﾞﾙｰﾍﾞﾘｰ","ﾏﾝｺﾞｰ","茶","いぐさ\n畳表","葉たばこ","乳牛50頭","乳牛80頭","乳牛200頭","肉用牛(繁殖)\n30頭(黒毛)","肉用牛(繁殖)\n80頭(黒毛)","肉用牛(繁殖)\n200頭(黒毛)","肉用牛(繁殖肥育)\n100頭(黒毛)","肉用牛(肥育)\n300頭(黒毛)","肉用牛(肥育)\n400頭(交雑種)","豚","鶏採卵","鶏肉用鶏","飼料用米","鶏:採卵3万羽規模千羽当","鶏:ﾌﾞﾛｲﾗｰ5万羽規模千羽当","水稲（４０ｈａ）ドローン","酪農（８０頭）餌よせロボット、哺乳ロボット","酪農（200頭）餌よせロボット、哺乳ロボット、分娩発情監視装置","肉用牛繁殖（８０頭）哺乳ロボット、分娩発情監視装置","肉用牛（２００頭）哺乳ロボット、分娩発情監視装置"]
[3,null,null,null,null,null,null,null,null,null,null,null,null,null,null,null,null,null,null,null,null,null,null,null,null,null,null,null,null,null,null,null,null,null,null,null,null,null,null,null,null,null,null,null,null,null,null,null,null,null,null,null,null,null,null,null,null,null,null,null,null,null,null,null,null,null,null,null,null,null,null,null,null,null,null,null,null,null,null,null,null,null,null,null,null,null,null,null,null,null,null,null,null,null,null,null,null,null,null,null,null,null,null,null,null,null,null,null,null,null,null,null,null,null,null,null,null,null,null,null,null,null,null,null,null,null,null,null,null,null,null,null,null,null,null,null,null,null,"親子づけ"]
[4,"生産販売",null,null,"生産量",null,"kg・本・頭",520,510,520,520,450,420,250,3000,2315.7894736842109,2409.6385542168678,5000,4444.4444444444443,4200,5555.5555555555557,1650,4000,1579,12500,8500,20000,12500,7368,20000,9473.6842105263167,16209.473684210527,8244,8065,12632,7388,3146,2772,3309,3831,3598,3000,5133,5833,1383,906,3020,3200,3685,4920,3456,3691,6315.7894736842109,3978,5000,1158,2317,3300,2287,3672,3500,1054,40000,47000,43000,140000,120000,80000,33600,16800,60000,63300,76000,30000,30000,38000,36000,62800,45000,20000,10000,76000,3500,4000,4000,5500,6100,3000,3500,4500,4000,3000,3600,3000,3500,4000,2200,2000,3000,3200,4000,4500,3500,3000,2000,2000,2500,2800,2000,1300,1600,300,2400,3300,600,2000,344,1300,255,9991,9991,10423,0.96,0.96,0.96,488,490,480,74.099999999999994,19710,1000,520,18615,2800,520,10452,10423,0.96,0.96]
[5,null,null,null,"販売量",null,null,494,485,494,494,450,420,250,2700,2200,2000,4500,4000,4000,5000,1600,3800,1500,11500,8000,18400,11500,7000,18400,9000,15399,7832,7500,12000,6649,2926,2633,3143,3448,3238,2700,4877,5542,1314,861,2239,3000,3501,4674,3284,3506,6000,2625,4000,1100,2200,3135,2173,3488,3000,1001,37800,43000,38700,120000,100000,75000,30240,15120,50000,57000,68400,26000,26000,34200,32000,56500,42000,19000,9500,65000,3325,3600,3600,5225,5795,2400,3150,4275,3600,2700,3240,2700,2975,3400,1980,1800,2850,3040,3400,3600,3150,2850,1700,1800,2375,2520,1800,1170,1520,270,2160,2970,570,1800,344,420,255,9991,9991,10423,0.94,0.94,0.95,0.92100000000000004,0.65300000000000002,0.53500000000000003,25,19316,1000,520,18242.7,2800,494,10452,10423,0.95,0.95]
{"$rows_left_out":98}